(6E,8E)-6,8,10-Undecatrien-3-one

Normal alkane RI, polar column, temperature ramp

Data compiled by: NIST Mass Spectrometry Data Center, William E. Wallace, director

Column type CapillaryCapillary
Active phase TC-WaxTC-WAX
Column length (m) 60.60.
Carrier gas HeliumHelium
Substrate
Column diameter (mm) 0.250.25
Phase thickness (μm)
Tstart (C) 40.40.
Tend (C) 230.230.
Heat rate (K/min) 3.3.
Initial hold (min)  3.
Final hold (min)
I 1924.1924.
ReferenceMiyazawa, Nakanishi, et al., 2009Miyazawa, Tomita, et al., 2009
Comment MSDC-RI MSDC-RI

References

Miyazawa, Nakanishi, et al., 2009
Miyazawa, N.; Nakanishi, A.; Tomita, N.; Ohkubo, Y.; Maeda, T.; Fujita, A., Novel key aroma components of Galbanum oil, J. Agric. Food Chem., 2009, 57, 4, 1433-1439, https://doi.org/10.1021/jf803157j . [all data]

Miyazawa, Tomita, et al., 2009
Miyazawa, N.; Tomita, N.; Kurobayashi, Y.; Nakanishi, A.; Ohkubo, Y.; Maeda, T.; Fujita, A., Novel character impact compounds in Yuzu (Citrus junos Sieb. ex Tanaka) Peel oil, J. Agric. Food Chem., 2009, 57, 5, 1990-1996, https://doi.org/10.1021/jf803257x . [all data]