di-exo-T-Cadinol
- Formula: C15H26O
- Molecular weight: 222.3663
- IUPAC Standard InChIKey: LHYHMMRYTDARSZ-XGUBFFRZSA-N
- Chemical structure:
View 3d structure (requires JavaScript / HTML 5) - Stereoisomers:
- 1-Naphthalenol, 1,2,3,4,4a,7,8,8a-octahydro-1,6-dimethyl-4-(1-methylethyl)-, [1R-(1α,4β,4aβ,8aβ)]-
- τ-Muurolol
- 1-Naphthalenol, 1,2,3,4,4a,7,8,8a-octahydro-1,6-dimethyl-4-(1-methylethyl)-, [1R-(1α,4β,4aβ,8aβ)]-
- α-Cadinol
- τ-Cadinol
- Amorph-4-en-10-ol
- trans-Cadinol
- trans-Muurolol
- 10-epi- α-cadinol
- 10-epi-α-Muurolol
- (Z)-α-Cadinol
- Cadin-4-en-10-β-ol
- amorph-4-en-10α-ol
- α-Cadinol, isomer 1
- α-Cadinol, isomer 2
- amorph-4-en-10β-ol
- Cadinol
- epi-α-Muurolol
- α-Muurolol
- epi-α-Cadinol
- 1-epi-Cadinol
- β-Cadin-4-en-10-ol
- α-epi-Cadinol
- trans-Muurolol
- Pilgerol
- 1-Muurolol (?)

Normal alkane RI, non-polar column, custom temperature program

Column type | Active phase | I | Reference | Comment |
---|---|---|---|---|
Capillary | DB-5 | 1479. | Courtois, Paine, et al., 2009 | 30. m/0.25 mm/0.25 μm, Helium; Program: 50 0C m6 0C/min -> 140 0C 5 0C/min -> 160 0C (1 min) 10 0C/min -> 200 0C |

References

Courtois, Paine, et al., 2009
Courtois, E.A.; Paine, C.E.; Blandinieres, P.-A.; Stien, D.; Bessiere, J.-M.; Houel, E.; Baraloto, C.; Chave, J.,
Diversity of the volatile organic compounds emitted by 55 species of tropical trees: a survey in French Guiana,
J. Chem. Ecol., 2009, 35, 11, 1349-1362, https://doi.org/10.1007/s10886-009-9718-1
. [all data]