2-epi-α-Funebrene
- Formula: C15H24
- Molecular weight: 204.3511
- IUPAC Standard InChIKey: IRAQOCYXUMOFCW-COMQUAJESA-N
- Chemical structure:
View 3d structure (requires JavaScript / HTML 5) - Stereoisomers:
- 1H-3a,7-Methanoazulene, 2,3,4,7,8,8a-hexahydro-3,6,8,8-tetramethyl-, [3R-(3α,3aβ,7β,8aα)]-
- Di-epi-α-cedrene
- 2-epi-α-Funebrene
- 1H-3a,7-Methanoazulene,2,3,4,7,8,8a -hexahydro-3,6,8,8-tetramethyl-
- 7-epi-α-Cedrene
- 1H,3a,7-Methanoazulene-2,3,4,7,8,8a-hexahydro-3,6,8,8-tetramethyl, [3Rα,3aβ,7β,8aα)
- α-Funebrene
- 1,7-di-epi-α-Cedrene

Normal alkane RI, non-polar column, custom temperature program

Column type | Active phase | I | Reference | Comment |
---|---|---|---|---|
Capillary | DB-5 | 1419. | Courtois, Paine, et al., 2009 | 30. m/0.25 mm/0.25 μm, Helium; Program: 50 0C m6 0C/min -> 140 0C 5 0C/min -> 160 0C (1 min) 10 0C/min -> 200 0C |

References

Courtois, Paine, et al., 2009
Courtois, E.A.; Paine, C.E.; Blandinieres, P.-A.; Stien, D.; Bessiere, J.-M.; Houel, E.; Baraloto, C.; Chave, J.,
Diversity of the volatile organic compounds emitted by 55 species of tropical trees: a survey in French Guiana,
J. Chem. Ecol., 2009, 35, 11, 1349-1362, https://doi.org/10.1007/s10886-009-9718-1
. [all data]