10-Hydroxybenz[a]pyrene
- Formula: C20H12O
- Molecular weight: 268.3087
- IUPAC Standard InChIKey: ANHMWNGBSJFXSA-UHFFFAOYSA-N
- Chemical structure:
View 3d structure (requires JavaScript / HTML 5) - Permanent link for this species. Use this link for bookmarking this species for future reference.

Normal alkane RI, non-polar column, temperature ramp

Column type | Active phase | I | Reference | Comment |
---|---|---|---|---|
Capillary | DB-5 | 3187. | Amorim, Dimandja, et al., 2009 | 30. m/0.25 mm/0.25 μm, Hydrogen, 70. C @ 0.5 min, 5. K/min, 280. C @ 17.5 min |

References

Amorim, Dimandja, et al., 2009
Amorim, L.C.A.; Dimandja, J.-M.; Cardeal, Z. de.L.,
Analysis of hydroxylated polycyclic aromatoc hydrocarbons in urine using comprehensive two-dimensional gas chromatography with a flame ionization detector,
J. Chromatogr. A., 2009, 1216, 14, 2900-2904, https://doi.org/10.1016/j.chroma.2008.11.012
. [all data]