1H,3a,7-Methanoazulene-2,3,4,7,8,8a-hexahydro-3,6,8,8-tetramethyl, [3Rα,3aβ,7β,8aα)
- Formula: C15H24
- Molecular weight: 204.3511
- IUPAC Standard InChIKey: IRAQOCYXUMOFCW-OSFYFWSMSA-N
- Chemical structure:
View 3d structure (requires JavaScript / HTML 5) - Stereoisomers:

Normal alkane RI, non-polar column, custom temperature program

Column type | Active phase | I | Reference | Comment |
---|---|---|---|---|
Capillary | Squalane | 1397. | Chen, 2008 | Program: not specified |

References

Chen, 2008
Chen, H.-F.,
Quantitative prediction of gas chromatography retention indices with support vector machines, radial basis neutral networks and multiple linear regression,
Anal. Chim. Acta, 2008, 609, 1, 24-36, https://doi.org/10.1016/j.aca.2008.01.003
. [all data]