19-Oxo-ent-kaur-16-ene
- Formula: C20H30O
- Molecular weight: 286.4516
- IUPAC Standard InChIKey: JCAVDWHQNFTFBW-GTYQWKCWSA-N
- Chemical structure:
View 3d structure (requires JavaScript / HTML 5) - Stereoisomers:

Normal alkane RI, non-polar column, temperature ramp

Column type | Active phase | I | Reference | Comment |
---|---|---|---|---|
Capillary | AT-5 | 2255. | Meccia, Rojas, et al., 2007 | 60. m/0.25 mm/0.25 μm, Helium, 4. K/min; Tstart: 60. C; Tend: 260. C |

References

Meccia, Rojas, et al., 2007
Meccia, G.; Rojas, L.B.; Velasco, J.; Diaz, T.; Usubillaga, A.,
Composition and antibacterial screening of the essential oils of leaves and roots of Espeletiopsis angustifolia Cuetrec,
Natural Product Communications, 2007, 2, 12, 1221-1224. [all data]