Methyltestosterone M (5B-Androstan-17A-methyl-3A,17B-diol), TMS
- Formula: C26H50O2Si2
- Molecular weight: 450.8450
- IUPAC Standard InChIKey: GNQZRHQPXWSWJC-LZPYLAFSSA-N
- Chemical structure:
View 3d structure (requires JavaScript / HTML 5) - Stereoisomers:
- 17-Methyl-5α-androstane-3β,17β-diol, 2TMS derivative
- 17-α-Methyl-5-α-androstan-3-β,17-β-diol, per-TMS
- 17-α-Methyl-5-β-androstan-3-β,17-β-diol, per-TMS
- 17-β-Methyl-5-α-androstan-3-α,17-α-diol, per-TMS
- 17-β-Methyl-5-β-androstan-3-α,17-α-diol, per-TMS
- 17-β-Methyl-5-β-androstan-3-β,17-α-diol, per-TMS
- 5α-Androstan-17α-methyl-3α,17β-diol, TMS
- 5β-Androstan-17α-methyl-3α,17β-diol, TMS
- Methylandrostanediol (5A-Androstan-17A-methyl-3A,17B-diol), TMS
- 17-α-Methyl-5-β-androstan-3-α,17-β-diol, per-TMS
- 17α-Methyl-5α-androstane-3α,17β-diol, 2TMS derivative

Normal alkane RI, non-polar column, custom temperature program

Column type | Active phase | I | Reference | Comment |
---|---|---|---|---|
Capillary | DB-1 | 2643. | Bowers, 1996 | 30. m/0.25 mm/0.25 μm, Helium; Program: 170 0C 20 0C/min -> 260 0C 2.7 0C/min -> 305 0C 20 0C/min -> 320 0C |

References

Bowers, 1996
Bowers, L.D.,
Separation and confirmation of anabolic steroids with quadrupole ion trap tandem mass spectrometry,
J. Chromatogr. B, 1996, 687, 1, 69-78, https://doi.org/10.1016/S0378-4347(96)00231-9
. [all data]