Danazol (2,4-Pregnadien-(2,3-d)isoxazol-17A-ethynyl-17B-ol), TMS
- Formula: C25H35NO2Si
- Molecular weight: 409.6364
- IUPAC Standard InChIKey: GYVWITJCAJQCRU-ZEKWSJBJSA-N
- Chemical structure:
View 3d structure (requires JavaScript / HTML 5) - Permanent link for this species. Use this link for bookmarking this species for future reference.

Normal alkane RI, non-polar column, custom temperature program

Column type | Active phase | I | Reference | Comment |
---|---|---|---|---|
Capillary | DB-1 | 3111. | Bowers, 1996 | 30. m/0.25 mm/0.25 μm, Helium; Program: 170 0C 20 0C/min -> 260 0C 2.7 0C/min -> 305 0C 20 0C/min -> 320 0C |

References

Bowers, 1996
Bowers, L.D.,
Separation and confirmation of anabolic steroids with quadrupole ion trap tandem mass spectrometry,
J. Chromatogr. B, 1996, 687, 1, 69-78, https://doi.org/10.1016/S0378-4347(96)00231-9
. [all data]