5-epi-Paradisol
- Formula: C15H26O
- Molecular weight: 222.3663
- IUPAC Standard InChIKey: DPQYOKVMVCQHMY-APIJFGDWSA-N
- Chemical structure:
View 3d structure (requires JavaScript / HTML 5) - Stereoisomers:

Normal alkane RI, non-polar column, temperature ramp

Column type | Active phase | I | Reference | Comment |
---|---|---|---|---|
Capillary | DB-1 | 1600. | Kesselmans and Wijnberg, 1992 | 60. m/0.25 mm/0.25 μm, Hydrogen, 4. K/min, 238. C @ 8. min; Tstart: 50. C |

Normal alkane RI, polar column, temperature ramp

Column type | Active phase | I | Reference | Comment |
---|---|---|---|---|
Capillary | DB-Wax | 2154. | Kesselmans and Wijnberg, 1992 | 60. m/0.25 mm/0.25 μm, Hydrogen, 4. K/min, 238. C @ 8. min; Tstart: 50. C |

References

Kesselmans and Wijnberg, 1992
Kesselmans, R.P.W.; Wijnberg, J.B.P.A.,
Chromatographic and spectroscopic data of all stereoisomers of eudesm-11-en-4-ol,
J. Essent. Oil Res., 1992, 4, 3, 201-217, https://doi.org/10.1080/10412905.1992.9698050
. [all data]