Benzaldehyde, 2-hydroxy-5-tert.-butyl, oxime, TMS

Van Den Dool and Kratz RI, non-polar column, temperature ramp

View large format table.

Column type Active phase I Reference Comment
PackedSE-301763.Staniewski and Szymanowski, 1990He, Gas Chrom Q, 6. K/min; Column length: 2. m; Tstart: 50. C
PackedSE-301762.Staniewski and Szymanowski, 1990He, Gas Chrom Q, 6. K/min; Column length: 2. m; Tstart: 50. C

References

Staniewski and Szymanowski, 1990
Staniewski, J.; Szymanowski, J., Gas chromatographic analyses of hydroxyoxime extractants of metals and their intermediates. I. Alkylsalicylaldehyde oximes, J. Chromatogr., 1990, 503, 442-448, https://doi.org/10.1016/S0021-9673(01)81524-7 . [all data]