4,5,6,7-Tetrahydropyrazolo[1,5-d][1,2,4]-triazin-4-one, 2,5,7,7-tetramethyl

Normal alkane RI, non-polar column, isothermal

Data compiled by: NIST Mass Spectrometry Data Center, William E. Wallace, director

Column type Packed
Active phase OV-101
Column length (m) 2.
Carrier gas Nitrogen
Substrate Gas-Chrom Q (80-100 mesh)
Column diameter (mm)
Phase thickness (μm)
Temperature (C) 220.
I 1554.
ReferenceBidlo-Igloy, Szederkenyi, et al., 1986
Comment MSDC-RI

References

Bidlo-Igloy, Szederkenyi, et al., 1986
Bidlo-Igloy, M.; Szederkenyi, F.; Tihanyi, E., Structure-retention correlations of dihydropyrazolo-triazinone derivatives in thin-layer and gas chromatography, J. Chromatogr., 1986, 365, 145-153, https://doi.org/10.1016/S0021-9673(01)81551-X . [all data]