Pregnanolone TMS

Normal alkane RI, non-polar column, isothermal

View large format table.

Column type Active phase Temperature (C) I Reference Comment
CapillaryOV-101240.2658.Krupcik, Rutten, et al., 1976Column length: 30. m; Column diameter: 0.25 mm
CapillaryOV-101251.2675.Krupcik, Rutten, et al., 1976Column length: 30. m; Column diameter: 0.25 mm

References

Krupcik, Rutten, et al., 1976
Krupcik, J.; Rutten, G.A.F.M.; Rijks, J.A., The influence of temperature on the separation and characterization of steroids on non-polar glass capillary columns, Chem. zvesti, 1976, 30, 4, 469-479. [all data]