Brallobarbital M (des-Br, OH)
- Formula: C10H12N2O4
- Molecular weight: 224.2133
- IUPAC Standard InChIKey: NUGVFEZFAAGPMS-UHFFFAOYSA-N
- Chemical structure:
View 3d structure (requires JavaScript / HTML 5) - Permanent link for this species. Use this link for bookmarking this species for future reference.

Kovats' RI, non-polar column, temperature ramp

Column type | Active phase | I | Reference | Comment |
---|---|---|---|---|
Packed | SE-30 | 1795. | Maurer, 1990 | N2, 100. C @ 3. min, 30. K/min, 310. C @ 5. min |

References

Maurer, 1990
Maurer, H.H.,
Identification and differentiation of barbiturates, other sedative-hypnotics and their metabolites in urine integrated in a general screening procedure using computerized gas chromatography-mass spectrometry,
J. Chromatogr., 1990, 530, 307-326, https://doi.org/10.1016/S0378-4347(00)82334-8
. [all data]