trans-Muurola-4(14),4-diene
- Formula: C15H24
- Molecular weight: 204.3511
- IUPAC Standard InChIKey: RNDFUOKDULDZPR-MELADBBJSA-N
- Chemical structure:
View 3d structure (requires JavaScript / HTML 5) - Species with the same structure:
- Stereoisomers:

Normal alkane RI, non-polar column, custom temperature program

Column type | Active phase | I | Reference | Comment |
---|---|---|---|---|
Capillary | HP-5 MS | 1491. | Eason and Setzer, 2007 | 30. m/0.25 mm/0.25 μm, Helium; Program: 40 0C (10 min) 3 0C/min -> 200 0C 2 0C/min -> 220 0C |

References

Eason and Setzer, 2007
Eason, H.M.; Setzer, W.N.,
BArk essential oil composition of Cedrela tinduzii C. DC. (Meliaceae) from Monteverde, Costa Rica,
Rec. NAt. Prod., 2007, 1, 2-3, 24-27. [all data]