β-Ionone, 5,6-epoxy

Normal alkane RI, non-polar column, custom temperature program

View large format table.

Column type Active phase I Reference Comment
CapillaryHP-5 MS1488.Xian, Chen, et al., 200630. m/0.25 mm/0.25 μm, Helium; Program: 40 0C (3 min) 6 0C/min -> 150 0C (1 min) 10 0C/min -> 250 0C (10 min)

References

Xian, Chen, et al., 2006
Xian, Q.-M.; Chen, H.-D.; Zou, H.-H., Allelopathic activity of volatile substance from submerged macrophytes on Microcystin aeruginosa, Acta Ecologica Sinica, 2006, 26, 11, 3549-3554, https://doi.org/10.1016/S1872-2032(06)60054-1 . [all data]