(5S,7S,10R)-cis-β-Elemene, diastereomer
- Formula: C15H24
- Molecular weight: 204.3511
- IUPAC Standard InChIKey: OPFTUNCRGUEPRZ-RBSFLKMASA-N
- Chemical structure:
View 3d structure (requires JavaScript / HTML 5) - Stereoisomers:
- Elemene
- Cyclohexane, 1-ethenyl-1-methyl-2,4-bis(1-methylethenyl)-, (1α,2β,4β)-
- Cyclohexane, 1-ethenyl-1-methyl-2,4-bis(1-methylethenyl)-, [1S-(1α,2β,4β)]-
- (Z)-β-Elemene
- cis-β-Elemene diastereomer
- (E)-β-Elemene
- (-)-(5R,7S,10S)-cis-β-Elemene
- 1-Ethenyl-1-methyl-2,4-bis-(1-methylethenyl)cyclohexane
- τ-Elemene

Normal alkane RI, non-polar column, temperature ramp

Column type | Active phase | I | Reference | Comment |
---|---|---|---|---|
Capillary | CP Sil 5 CB | 1387. | Adio, 2005 | H2, 3. K/min; Column length: 25. m; Tstart: 50. C; Tend: 230. C |

References

Adio, 2005
Adio, A.M.,
Isolation and structure elucidation of sesquiterpenoids from the essential oils of some liverworths (Hepaticae), Dissertation, Hamburg University, 2005, 265. [all data]