(-)-(1R,2S,6R,10S)-2α-Acetoxyamorpha-4,7(11)-diene
- Formula: C17H26O2
- Molecular weight: 262.3871
- IUPAC Standard InChIKey: CWMAZHJECLOCQL-IEAZIUSSSA-N
- Chemical structure:
View 3d structure (requires JavaScript / HTML 5) - Stereoisomers:

Normal alkane RI, non-polar column, temperature ramp

Column type | Active phase | I | Reference | Comment |
---|---|---|---|---|
Capillary | CP Sil 5 CB | 1800. | Adio, 2005 | H2, 3. K/min; Column length: 25. m; Tstart: 50. C; Tend: 230. C |

References

Adio, 2005
Adio, A.M.,
Isolation and structure elucidation of sesquiterpenoids from the essential oils of some liverworths (Hepaticae), Dissertation, Hamburg University, 2005, 265. [all data]