(6S)-2-Methyl-6-[(1R)-4-methylenecyclohex-2-enyl]hept-2-ene
- Formula: C15H24
- Molecular weight: 204.3511
- IUPAC Standard InChIKey: PHWISBHSBNDZDX-CABCVRRESA-N
- Chemical structure:
View 3d structure (requires JavaScript / HTML 5) - Stereoisomers:

Normal alkane RI, non-polar column, temperature ramp

Column type | Active phase | I | Reference | Comment |
---|---|---|---|---|
Capillary | DB-5MS | 1537. | Robledo and Arzuffi, 2004 | 30. m/0.25 mm/0.25 μm, 30. K/min, 200. C @ 10. min; Tstart: 90. C |

References

Robledo and Arzuffi, 2004
Robledo, N.; Arzuffi, R.,
Identificacion de los compuestos volatiles de papaya y cuaguayote mediante microextraccion en fase solida, cromatografia de gases y espectrometria de masas,
Rev. Latinoamericana Quim., 2004, 32, 1, 30-36. [all data]