2-Ethyl-1,2-dibromobutane
- Formula: C6H12Br2
- Molecular weight: 243.967
- IUPAC Standard InChIKey: UBFOYEMXPUOMHZ-UHFFFAOYSA-N
- Chemical structure:
View 3d structure (requires JavaScript / HTML 5) - Species with the same structure:

Normal alkane RI, non-polar column, temperature ramp

Column type | Active phase | I | Reference | Comment |
---|---|---|---|---|
Capillary | HP-PONA | 1124. | Liu and Yang, 2003 | 50. m/0.20 mm/0.50 μm, 35. C @ 8. min, 3.5 K/min, 230. C @ 10. min |

References

Liu and Yang, 2003
Liu, Y.; Yang, H.,
Detailed alkene determination by bromination and gas chromatography with atomic emission detection. I. identification of the bromoalkenes/bromoalkanes in brominated gasoline,
Se Pu - Chinese Journal of Chromatography, 2003, 21, 1, 1-8. [all data]