Cumyl bromide
- Formula: C9H11Br
- Molecular weight: 199.088
- IUPAC Standard InChIKey: WSFSJXBURLJOFD-UHFFFAOYSA-N
- Chemical structure:
View 3d structure (requires JavaScript / HTML 5) - Species with the same structure:

Normal alkane RI, non-polar column, temperature ramp

Column type | Active phase | I | Reference | Comment |
---|---|---|---|---|
Capillary | SE-30 | 1181. | Krasnykh, Vasiltsova, et al., 2002 | Nitrogen, 30. C @ 5. min, 10. K/min; Column length: 25. m; Tend: 250. C |

References

Krasnykh, Vasiltsova, et al., 2002
Krasnykh, Eugen L.; Vasiltsova, Tatiana V.; Verevkin, Sergey P.; Heintz, Andreas,
Vapor Pressures and Enthalpies of Vaporization of Benzyl Halides and Benzyl Ethers,
J. Chem. Eng. Data, 2002, 47, 6, 1372-1378, https://doi.org/10.1021/je020034h
. [all data]