2'-Ethylacetophenone
- Formula: C10H12O
- Molecular weight: 148.2017
- IUPAC Standard InChIKey: VLILFBZIVHDKIJ-UHFFFAOYSA-N
- Chemical structure:
View 3d structure (requires JavaScript / HTML 5) - Species with the same structure:

Normal alkane RI, non-polar column, custom temperature program

Column type | Active phase | I | Reference | Comment |
---|---|---|---|---|
Capillary | HP Ultra 1 | 1210. | Hernandes, Vargas-Arispuro, et al., 1999 | 25. m/0.20 mm/0.33 μm, Nitrogen; Program: 50 0C 4 0C/min -> 180 0C 10 0C/min -> 280 0C |

References

Hernandes, Vargas-Arispuro, et al., 1999
Hernandes, N.N.; Vargas-Arispuro, I.; Sanz, I.; Adelantado, M.; Primo-Yufera, E.,
Electroantennogram activity and attraction assay of Ceratitis capitata to aiborne volatiles from peach at three ripeness stages,
The Southwestern entomologist, 1999, 24, 2, 133-142. [all data]