1(10)-Aristolene
- Formula: C15H24
- Molecular weight: 204.3511
- IUPAC Standard InChIKey: MBIPADCEHSKJDQ-PBOSXPJTSA-N
- Chemical structure:
View 3d structure (requires JavaScript / HTML 5) - Stereoisomers:
- 1H-Cyclopropa[a]naphthalene, 1a,2,3,5,6,7,7a,7b-octahydro-1,1,7,7a-tetramethyl-, [1aR-(1aα,7α,7aα,7bα)]-
- [1aR-(1a,R,7R,7aR,7bR)]-1a,2,3,5,6,7,7a,7bocta-hydro-1,1,7,7a-tetramethyl-1H-cyclopropa[a]naphthalene
- β-Calarene
- 1H-Cycloprop[a]naphthalene, 1a,2,3,5,6,7a,7b-octahydro-1,1,7,7a-tetramethyl, [1aR,1aα,7α,7bβ]
- 1H-Cyclopropa[a]naphthalene, 1a,2,3,5,6,7a,7b-octahydro-1,1,7,7a-tetramethyl-, 1aR-1aα,7α,7aα,7bβ
- 1aα,7α,7aα,7bα-1H-Cyclopropa[a]naphthalene, 1a,2,3,5,6,7,7a,7b-octahydro-1,1,7,7a-tetramethyl

Normal alkane RI, non-polar column, custom temperature program

Column type | Active phase | I | Reference | Comment |
---|---|---|---|---|
Capillary | HP Ultra 1 | 1370. | Hernandes, Vargas-Arispuro, et al., 1999 | 25. m/0.20 mm/0.33 μm, Nitrogen; Program: 50 0C 4 0C/min -> 180 0C 10 0C/min -> 280 0C |

References

Hernandes, Vargas-Arispuro, et al., 1999
Hernandes, N.N.; Vargas-Arispuro, I.; Sanz, I.; Adelantado, M.; Primo-Yufera, E.,
Electroantennogram activity and attraction assay of Ceratitis capitata to aiborne volatiles from peach at three ripeness stages,
The Southwestern entomologist, 1999, 24, 2, 133-142. [all data]