Wine lactone, (3S, 3aS, 7aS)
- Formula: C10H14O2
- Molecular weight: 166.2170
- IUPAC Standard InChIKey: NQWBFQXRASPNLB-HLTSFMKQSA-N
- Chemical structure:
View 3d structure (requires JavaScript / HTML 5) - Stereoisomers:

Normal alkane RI, non-polar column, custom temperature program

Column type | Active phase | I | Reference | Comment |
---|---|---|---|---|
Capillary | DB-5 | 1422. | Guth, 1996 | Column length: 20. m; Column diameter: 0.25 mm; Program: not specified |

Normal alkane RI, polar column, custom temperature program

Column type | Active phase | I | Reference | Comment |
---|---|---|---|---|
Capillary | FFAP | 2129. | Guth, 1996 | Column length: 20. m; Column diameter: 0.25 mm; Program: not specified |

References

Guth, 1996
Guth, H.,
131. Determination of the configuration of wine lactone,
Helv. Chim. Acta, 1996, 79, 6, 1559-1571, https://doi.org/10.1002/hlca.19960790606
. [all data]