1(6)-Tetrahydrocannabinol
- Formula: C21H30O2
- Molecular weight: 314.4617
- IUPAC Standard InChIKey: CYQFCXCEBYINGO-ZYMOGRSISA-N
- Chemical structure:

Normal alkane RI, non-polar column, isothermal

Column type | Active phase | Temperature (C) | I | Reference | Comment |
---|---|---|---|---|---|
Packed | OV-1 | 180. | 2418. | Gizella, Szabolcs, et al., 1995 | N2, Chromosorb WHP; Column length: 2.6 m |

References

Gizella, Szabolcs, et al., 1995
Gizella, P.; Szabolcs, N.; Peep, V.; György, O.P.T.,
Kannabinoidok gázkromatográfiás vizsgálata tandem oszlopokon,
Acta Pharm. Hung., 1995, 65, 63-67. [all data]