1,4-Dipentylisoquinoline
- Formula: C19H27N
- Molecular weight: 269.4244
- IUPAC Standard InChIKey: UKODNDSPGMOPGN-UHFFFAOYSA-N
- Chemical structure:
View 3d structure (requires JavaScript / HTML 5) - Permanent link for this species. Use this link for bookmarking this species for future reference.

Normal alkane RI, non-polar column, custom temperature program

Column type | Active phase | I | Reference | Comment |
---|---|---|---|---|
Packed | SE-30 | 2150. | Xiaoyun, Xiammou, et al., 1991 | Column length: 2. m; Program: not specified |

References

Xiaoyun, Xiammou, et al., 1991
Xiaoyun, J.; Xiammou, Z.; Yijian, G.,
Kovats retention indices of some alkylquinolines, alkylisoquinolines, phenylalkyl- and phenoxyalkylpyridines,
Chin, J, Chromatogr., 1991, 9, 3, 187-191. [all data]