Cyclizine M (hydroxy-methoxy-benzophenone), isomer 1, acetylated
- Formula: C16H14O4
- Molecular weight: 270.2800
- IUPAC Standard InChIKey: LSAOBOVPVPSBSX-UHFFFAOYSA-N
- Chemical structure:

Normal alkane RI, non-polar column, temperature ramp

Column type | Active phase | I | Reference | Comment |
---|---|---|---|---|
Capillary | HP-1 | 2090. | Maurer and Pfleger, 1988 | 12. m/0.20 mm/0.33 μm, He, 100. C @ 3. min, 30. K/min, 310. C @ 5. min |
Capillary | HP-1 | 2090. | Maurer and Pfleger, 1988 | 12. m/0.20 mm/0.33 μm, He, 100. C @ 3. min, 30. K/min, 310. C @ 5. min |

References

Maurer and Pfleger, 1988
Maurer, H.; Pfleger, K.,
Toxicological detection of ethylenediamine and piperazine antihistamines and their metabolites in urine by computerized gas chromatography-mass spectrometry,
Fresenius Z. Anal. Chem., 1988, 331, 7, 744-756, https://doi.org/10.1007/BF01105612
. [all data]