Pyridine, 5-ethyl-2,4-dimethyl
- Formula: C9H13N
- Molecular weight: 135.2062
- IUPAC Standard InChIKey: HDNSOESVSNPVNA-UHFFFAOYSA-N
- Chemical structure:
View 3d structure (requires JavaScript / HTML 5) - Permanent link for this species. Use this link for bookmarking this species for future reference.

Kovats' RI, non-polar column, isothermal

Column type | Active phase | Temperature (C) | I | Reference | Comment |
---|---|---|---|---|---|
Capillary | OV-1 | 70. | 1125. | Nabivach, 1989 | |
Packed | Apiezon L | 130. | 1170. | Shatts, Avots, et al., 1977 | He, Chromosorb W AW-DMCS; Column length: 2.4 m |

References

Nabivach, 1989
Nabivach, V.M.,
Calculation of gas chromatographic retention indices for alkylpyridines from their structural characteristics,
Zh. Anal. Khim., 1989, 44, 9, 1615-1621. [all data]
Shatts, Avots, et al., 1977
Shatts, V.D.; Avots, A.A.; Belikov, V.A.,
Retention indices of alkylpyridines,
Zh. Anal. Khim., 1977, 32, 4, 631-638. [all data]