Pyridine, 3-ethyl-2,5-dimethyl
- Formula: C9H13N
- Molecular weight: 135.2062
- IUPAC Standard InChIKey: PPSBKGGGGXWSAB-UHFFFAOYSA-N
- Chemical structure:
View 3d structure (requires JavaScript / HTML 5) - Other names: 3-ethyl-2,5-dimethylpyridine

Kovats' RI, non-polar column, isothermal

Column type | Active phase | Temperature (C) | I | Reference | Comment |
---|---|---|---|---|---|
Capillary | OV-1 | 70. | 1124. | Nabivach, 1989 |

Normal alkane RI, non-polar column, temperature ramp

Column type | Active phase | I | Reference | Comment |
---|---|---|---|---|
Capillary | DB-1 | 1084. | Yu, Wu, et al., 1994 | 60. m/0.25 mm/1. μm, He, 40. C @ 5. min, 2. K/min, 260. C @ 60. min |

References

Nabivach, 1989
Nabivach, V.M.,
Calculation of gas chromatographic retention indices for alkylpyridines from their structural characteristics,
Zh. Anal. Khim., 1989, 44, 9, 1615-1621. [all data]
Yu, Wu, et al., 1994
Yu, T.-H.; Wu, C.-M.; Ho, C.-T.,
Volatile compounds generated from the thermal interaction of glucose and alliin or deoxyalliin in propylene glycol,
Food Chem., 1994, 51, 3, 281-286, https://doi.org/10.1016/0308-8146(94)90028-0
. [all data]