Pyridine, 2,6-diethyl-3,4-dimethyl
- Formula: C11H17N
- Molecular weight: 163.2594
- IUPAC Standard InChIKey: PCPBCUVWNZKZFR-UHFFFAOYSA-N
- Chemical structure:
View 3d structure (requires JavaScript / HTML 5) - Permanent link for this species. Use this link for bookmarking this species for future reference.

Kovats' RI, non-polar column, isothermal

Column type | Active phase | Temperature (C) | I | Reference | Comment |
---|---|---|---|---|---|
Capillary | OV-1 | 70. | 1257. | Nabivach, 1989 |

References

Nabivach, 1989
Nabivach, V.M.,
Calculation of gas chromatographic retention indices for alkylpyridines from their structural characteristics,
Zh. Anal. Khim., 1989, 44, 9, 1615-1621. [all data]