propyl (E)-propenyl trisulfide
- Formula: C6H12S3
- Molecular weight: 180.354
- IUPAC Standard InChIKey: CKVNYTRYOFXVGM-HWKANZROSA-N
- Chemical structure:
View 3d structure (requires JavaScript / HTML 5) - Species with the same structure:
- Stereoisomers:
- Other names: Propyl 1-propenyl trisulfide, (E)-; Propyl (E)-1-propenyl trisulfide; (E)-1-Propenyl propyl trisulfide; (E)-Propenyl propyl trisulfide; propyl trans-1-propenyl trisulfide; Propyl 1-propenyl trisulphide, trans

Kovats' RI, non-polar column, isothermal

Column type | Active phase | Temperature (C) | I | Reference | Comment |
---|---|---|---|---|---|
Capillary | OV-101 | 130. | 1324. | Misharina and Golovnya, 1989 | He; Column length: 50. m; Column diameter: 0.32 mm |

Van Den Dool and Kratz RI, non-polar column, temperature ramp

Column type | Active phase | I | Reference | Comment |
---|---|---|---|---|
Capillary | DB-1 | 1324. | Pino, Fuentes, et al., 2001 | He, 60. C @ 4. min, 4. K/min; Column length: 30. m; Column diameter: 0.32 mm; Tend: 250. C |
Capillary | Ultra-1 | 1304.2 | Farkas, Hradský, et al., 1992 | 25. m/0.2 mm/0.33 μm, H2, 2. K/min; Tstart: 60. C; Tend: 230. C |
Capillary | OV-101 | 1320. | Misharina and Golovnya, 1989 | He, 4. K/min; Column length: 50. m; Column diameter: 0.32 mm; Tstart: 50. C; Tend: 250. C |

Van Den Dool and Kratz RI, polar column, temperature ramp

Column type | Active phase | I | Reference | Comment |
---|---|---|---|---|
Capillary | DB-Wax | 1770. | Nielsen, Larsen, et al., 2003 | 30. m/0.25 mm/0.25 μm, He, 40. C @ 10. min, 6. K/min, 240. C @ 30. min |

Normal alkane RI, non-polar column, custom temperature program

Column type | Active phase | I | Reference | Comment |
---|---|---|---|---|
Capillary | SE-30 | 1315. | Vinogradov, 2004 | Program: not specified |
Capillary | SE-30 | 1310. | Vinogradov, 2004 | Program: not specified |

Normal alkane RI, polar column, custom temperature program

Column type | Active phase | I | Reference | Comment |
---|---|---|---|---|
Capillary | DB-Wax | 1795. | Gyawalia, Seo, et al., 2006 | 60. m/0.2 mm/0.25 μm, He; Program: 40C(3min) => 2C/min => 150C => 4C/min => 220C(20min) => 5C/min => 230C |

References

Misharina and Golovnya, 1989
Misharina, T.A.; Golovnya, R.V.,
Regularities of retention of a pseudohomologous series of dialkylpolysulfides in capillary gas chromatography,
Zh. Anal. Khim., 1989, 44, 514-519. [all data]
Pino, Fuentes, et al., 2001
Pino, J.A.; Fuentes, V.; Correa, M.T.,
Volatile constituents of Chinese chive (Allium tuberosum Rottl. ex Sprengel) and Rakkyo (Allium chinense G. Don),
J. Agric. Food Chem., 2001, 49, 3, 1328-1330, https://doi.org/10.1021/jf9907034
. [all data]
Farkas, Hradský, et al., 1992
Farkas, P.; Hradský, P.; Kovác, M.,
Novel flavour components identified in the steamn distillate of onion (Allium cepa L.),
Z. Lebensm. Unters. Forsch., 1992, 195, 5, 459-462, https://doi.org/10.1007/BF01191718
. [all data]
Nielsen, Larsen, et al., 2003
Nielsen, G.S.; Larsen, L.M.; Poll, L.,
Formation of aroma compounds and lipoxygenase (EC 1.13.11.12) activity in unblanced leek (Allium ampeloprasum Var. Bulga) slices during long-term frozen storage,
J. Agric. Food Chem., 2003, 51, 7, 1970-1976, https://doi.org/10.1021/jf020921o
. [all data]
Vinogradov, 2004
Vinogradov, B.A.,
Production, composition, properties and application of essential oils, 2004, retrieved from http://viness.narod.ru. [all data]
Gyawalia, Seo, et al., 2006
Gyawalia, R.; Seo, H.-Y.; Lee, H.-J.; Song, H.-P.; Kim, D.-H.; Byun, M.-W.; Kim, K.-S.,
Effect of γ-irradiation on volatile compounds of dried Welsh onion (Allium fistulosum L.),
Radiat. Phys. Chem., 2006, 75, 2, 322-328, https://doi.org/10.1016/j.radphyschem.2005.07.001
. [all data]