3,18,20-Trioxo-11β,17α,21-trihydroxy-4-pregnene, MO-TMS, anti
- Formula: C33H61N3O6Si3
- Molecular weight: 680.1104
- IUPAC Standard InChIKey: KJYIOWAYVPRIOS-JDKVXDCSSA-N
- Chemical structure:

Normal alkane RI, non-polar column, custom temperature program

Column type | Active phase | I | Reference | Comment |
---|---|---|---|---|
Capillary | OV-1 | 3253. | Ulick, Chu, et al., 1983 | Column diameter: 0.25 mm; Phase thickness: 0.25 μm; Program: not specified |

References

Ulick, Chu, et al., 1983
Ulick, S.; Chu, M.D.; Land, M.,
Biosynthesis of 18-oxocortisol by aldosterone-producting adrenal tissue,
J. Biol. Chem., 1983, 258, 9, 5498-5502. [all data]