endo-Dicyclopentadiene
- Formula: C10H12
- Molecular weight: 132.2023
- IUPAC Standard InChIKey: HECLRDQVFMWTQS-RGOKHQFPSA-N
- Chemical structure:
View 3d structure (requires JavaScript / HTML 5) - Stereoisomers:

Normal alkane RI, non-polar column, isothermal

Column type | Active phase | Temperature (C) | I | Reference | Comment |
---|---|---|---|---|---|
Capillary | Squalane | 104. | 1011. | Bermejo, Blanco, et al., 1983 | N2; Column length: 50. m; Column diameter: 0.25 mm |

References

Bermejo, Blanco, et al., 1983
Bermejo, J.; Blanco, C.G.; Diez, M.A.; Suarez Canga, J.,
Identification of methyl and dimethyl derivatives of dicyclopentadiene,
AFINIDAD, 1983, 40, 386, 320-326. [all data]