cis,trans-Bicyclo[4.4.0]decane, 3-ethyl
- Formula: C12H22
- Molecular weight: 166.3031
- IUPAC Standard InChIKey: HLQZZLGOHWUHQM-SDDRHHMPSA-N
- Chemical structure:
View 3d structure (requires JavaScript / HTML 5) - Stereoisomers:

Normal alkane RI, non-polar column, isothermal

Column type | Active phase | Temperature (C) | I | Reference | Comment |
---|---|---|---|---|---|
Capillary | Squalane | 120. | 1243. | Rang, Kurashova, et al., 1982 | He; Column length: 50. m; Column diameter: 0.25 mm |

Normal alkane RI, polar column, isothermal

Column type | Active phase | Temperature (C) | I | Reference | Comment |
---|---|---|---|---|---|
Capillary | PEG-20M | 120. | 1360. | Rang, Kurashova, et al., 1982 | He; Column length: 100. m; Column diameter: 0.25 mm |

References

Rang, Kurashova, et al., 1982
Rang, S.; Kurashova, E.Kh.; Musaev, I.A.; Strenze, T.V.; Joepera, E.; Eisen, O.; Sanin, P.I.,
Gas-chromatographic characteristics of stereoisomers of the bicyblo[4.4.0]decane series,
Neftekhimiya, 1982, 22, 3, 303-308. [all data]