cis,cis-Bicyclo[4.4.0]decane, 2-methyl
- Formula: C11H20
- Molecular weight: 152.2765
- IUPAC Standard InChIKey: NHCREQREVZBOCH-OUAUKWLOSA-N
- Chemical structure:
View 3d structure (requires JavaScript / HTML 5) - Stereoisomers:
- Naphthalene,decahydro-1-methyl-(1α,4aβ,8aα
- 1-Methyldecahydronaphthalene
- Naphthalene,decahydro-1-methyl-(1α,4aα,8aβ
- cis-Decalin, trans-1e-methyl, r-9H
- trans-Decalin, 1a-methyl
- trans-Decalin, 1e-methyl
- cis,trans-Bicyclo[4.4.0]decane, 2-methyl
- trans,cis-Bicyclo[4.4.0]decane, 2-methyl
- trans,trans-Bicyclo[4.4.0]decane, 2-methyl
- 1-Methyldecalin, cis
- 1-Methyldecalin, trans

Normal alkane RI, non-polar column, isothermal

Column type | Active phase | Temperature (C) | I | Reference | Comment |
---|---|---|---|---|---|
Capillary | Squalane | 120. | 1192. | Rang, Kurashova, et al., 1982 | He; Column length: 50. m; Column diameter: 0.25 mm |

Normal alkane RI, polar column, isothermal

Column type | Active phase | Temperature (C) | I | Reference | Comment |
---|---|---|---|---|---|
Capillary | PEG-20M | 120. | 1340. | Rang, Kurashova, et al., 1982 | He; Column length: 100. m; Column diameter: 0.25 mm |

References

Rang, Kurashova, et al., 1982
Rang, S.; Kurashova, E.Kh.; Musaev, I.A.; Strenze, T.V.; Joepera, E.; Eisen, O.; Sanin, P.I.,
Gas-chromatographic characteristics of stereoisomers of the bicyblo[4.4.0]decane series,
Neftekhimiya, 1982, 22, 3, 303-308. [all data]