2,4,6-Trimethyl-1-nonene, # 2
- Formula: C12H24
- Molecular weight: 168.3190
- IUPAC Standard InChIKey: QFMQAIUZMMQKTB-UHFFFAOYSA-N
- Chemical structure:
- Other names: 1-Nonene, 2,4,6-trimethyl, # 2

Normal alkane RI, non-polar column, temperature ramp

Column type | Active phase | I | Reference | Comment |
---|---|---|---|---|
Capillary | Petrocol DH | 1086. | Sojak, Kubinec, et al., 2006 | 150. m/0.25 mm/1.0 μm, 1. K/min; Tstart: 40. C; Tend: 300. C |

Normal alkane RI, non-polar column, custom temperature program

Column type | Active phase | I | Reference | Comment |
---|---|---|---|---|
Packed | Apieson L | 1080. | Kojima, Fujii, et al., 1980 | Chromosorb W; Column length: 20. m; Program: not specified |

References

Sojak, Kubinec, et al., 2006
Sojak, L.; Kubinec, R.; Jurdakova, H.; Hajekova, E.; Bajus, M.,
GC-MS of polyethylene and polypropylene thermal cracking produxts,
Petroleum Coal, 2006, 48, 1, 1-14. [all data]
Kojima, Fujii, et al., 1980
Kojima, T.; Fujii, T.; Hosaka, Y.,
Thermal decomposition products of sterepisomeric polypropylenes,
Mass Spectrometry, 1980, 28, 4, 335-341. [all data]