2,4,6,8-Tetramethyl-1,8-nonadiene

Normal alkane RI, non-polar column, custom temperature program

View large format table.

Column type Active phase I Reference Comment
PackedApieson L1150.Kojima, Fujii, et al., 1980Chromosorb W; Column length: 20. m; Program: not specified

References

Kojima, Fujii, et al., 1980
Kojima, T.; Fujii, T.; Hosaka, Y., Thermal decomposition products of sterepisomeric polypropylenes, Mass Spectrometry, 1980, 28, 4, 335-341. [all data]