24R,25-Dihydroxycholecalciferol, methylboronate, 3-TMS, # 2

Normal alkane RI, non-polar column, isothermal

View large format table.

Column type Active phase Temperature (C) I Reference Comment
CapillaryOV-101260.3276.Halket, Ganschow, et al., 1980Helium; Column length: 25. m; Column diameter: 0.35 mm

References

Halket, Ganschow, et al., 1980
Halket, J.M.; Ganschow, I.; Lisboa, B.P., Gas chromatographic-mass spectrometric properties of boronate esters of 24R,25-dihydroxycholecalciferol, J. Chromatogr., 1980, 192, 2, 434-440, https://doi.org/10.1016/S0021-9673(80)80022-7 . [all data]