Indole, 3-(2-acetaminoethyl), 5-methoxy (Melatonin), TMS

Normal alkane RI, non-polar column, temperature ramp

Data compiled by: NIST Mass Spectrometry Data Center, William E. Wallace, director

Column type Packed
Active phase OV-1
Column length (m) 1.5
Carrier gas He
Substrate
Column diameter (mm)
Phase thickness (μm)
Tstart (C) 180.
Tend (C) 320.
Heat rate (K/min) 10.
Initial hold (min)
Final hold (min)
I 2400.
ReferenceFrancis, Smith, et al., 1980
Comment MSDC-RI

References

Francis, Smith, et al., 1980
Francis, P.; Smith, I.; Finnie, M.D.A., Mass spectrometric and chromatographic characteristics of neutral and acidic 5-methoxyindoles and some related compounds, Biomed. Mass Spectrom., 1980, 7, 7, 294-300, https://doi.org/10.1002/bms.1200070706 . [all data]