Triacontanal, 12-methyl
- Formula: C31H62O
- Molecular weight: 450.8234
- IUPAC Standard InChIKey: RNMRAWWQHFHBND-UHFFFAOYSA-N
- Chemical structure:

Normal alkane RI, non-polar column, temperature ramp

Column type | Active phase | I | Reference | Comment |
---|---|---|---|---|
Packed | Dexsil 300 | 3261. | Sonnet, Uebel, et al., 1979 | Column length: 1.2 m; Tstart: 200. C; Tend: 300. C |

References

Sonnet, Uebel, et al., 1979
Sonnet, P.E.; Uebel, E.C.; Lusby, W.R.; Schwarz, M.; Miller, R.W.,
Sex pheromone of the stable fly. Identification, synthesis, and evaluation of alkenes from female stable flies,
J. Chem. Ecol., 1979, 5, 3, 353-361, https://doi.org/10.1007/BF00987921
. [all data]