Sorbitol, acetylated
- Formula: C18H26O12
- Molecular weight: 434.3918
- IUPAC Standard InChIKey: NJVBTKVPPOFGAT-MHORFTMASA-N
- Chemical structure:
View 3d structure (requires JavaScript / HTML 5) - Stereoisomers:

Normal alkane RI, non-polar column, temperature ramp

Column type | Active phase | I | Reference | Comment |
---|---|---|---|---|
Packed | OV-5 | 1988. | Kajiyama and Hayashi, 1978 | 4. K/min; Column length: 4. m; Tstart: 100. C |
Packed | OV-5 | 1985. | Kajiyama and Hayashi, 1978 | 6. K/min; Column length: 4. m; Tstart: 100. C |

References

Kajiyama and Hayashi, 1978
Kajiyama, K.; Hayashi, Y.,
Gas chromatographic retention behaviour of trifluoroacetyl, acetyl and trimethylsilyl derivatives of various O-methylsorbitols,
Sen-I Gakkaishi, 1978, 34, 8, t366-t375, https://doi.org/10.2115/fiber.34.8_T366
. [all data]