Tricyclo[7.2.1.0(5,12)]dodecane, isomer # 1
- Formula: C12H20
- Molecular weight: 164.2872
- IUPAC Standard InChIKey: FZDZWLDRELLWNN-UHFFFAOYSA-N
- Chemical structure:
View 3d structure (requires JavaScript / HTML 5) - Species with the same structure:

Normal alkane RI, non-polar column, isothermal

Column type | Active phase | Temperature (C) | I | Reference | Comment |
---|---|---|---|---|---|
Capillary | SE-30 | 150. | 1274. | Vanek, Podrouzková, et al., 1970 | N2; Column length: 50. m; Column diameter: 0.25 mm |
Capillary | SE-30 | 175. | 1291. | Vanek, Podrouzková, et al., 1970 | N2; Column length: 50. m; Column diameter: 0.25 mm |

Normal alkane RI, polar column, isothermal

Column type | Active phase | Temperature (C) | I | Reference | Comment |
---|---|---|---|---|---|
Capillary | Carbowax 20M | 125. | 1430. | Vanek, Podrouzková, et al., 1970 | N2; Column length: 50. m; Column diameter: 0.25 mm |
Capillary | Carbowax 20M | 150. | 1462. | Vanek, Podrouzková, et al., 1970 | N2; Column length: 50. m; Column diameter: 0.25 mm |

References

Vanek, Podrouzková, et al., 1970
Vanek, J.; Podrouzková, B.; Landa, S.,
Gas chromatographic behaviour of tricyclic saturated hydrocarbons. The relation between the retention indices and the stereochemical structure of the tricyclanes,
J. Chromatogr., 1970, 52, 77-86, https://doi.org/10.1016/S0021-9673(01)96546-X
. [all data]