1-Chloro-2-methyl-2-butene, cis
- Formula: C5H9Cl
- Molecular weight: 104.578
- IUPAC Standard InChIKey: ZAJKEDQTROWDDD-HYXAFXHYSA-N
- Chemical structure:
View 3d structure (requires JavaScript / HTML 5) - Species with the same structure:
- Stereoisomers:

Normal alkane RI, non-polar column, isothermal

Column type | Active phase | Temperature (C) | I | Reference | Comment |
---|---|---|---|---|---|
Capillary | Squalane | 30. | 725. | Tourres, 1968 | Nitrogen; Column length: 50. m; Column diameter: 0.25 mm |
Capillary | Squalane | 50. | 727. | Tourres, 1968 | Nitrogen; Column length: 50. m; Column diameter: 0.25 mm |

References

Tourres, 1968
Tourres, D.A.,
Separation of mono- and dichloro-methyl butanes and of monochloro-methyl butenes by preparative gas chromatography,
Chromatographia, 1968, 1, 11-12, 437-442, https://doi.org/10.1007/BF02255759
. [all data]