4-Methyl-4-propylheptane

Normal alkane RI, non-polar column, isothermal

View large format table.

Column type Active phase Temperature (C) I Reference Comment
CapillaryApiezon L40. - 190.1022.Mann, Mühlstädt, et al., 1967Column length: 2. m

References

Mann, Mühlstädt, et al., 1967
Mann, G.; Mühlstädt, M.; Braband, J.; Döring, E., Konformation und physikalische daten von alkanen und cyclanen. II. Einfach und zweifach verzweigte alkane, Tetrahedron, 1967, 23, 8, 3393-3401, https://doi.org/10.1016/S0040-4020(01)92305-1 . [all data]