2-(2,2,2-trifluoroethyl)-5-chloro-2'-fluorobenzophenone (CFTB)
- Formula: C15H9ClF4O
- Molecular weight: 316.678
- IUPAC Standard InChIKey: SUCZMAOZMIDABG-UHFFFAOYSA-N
- Chemical structure:
View 3d structure (requires JavaScript / HTML 5) - Permanent link for this species. Use this link for bookmarking this species for future reference.

Kovats' RI, non-polar column, custom temperature program

Column type | Active phase | I | Reference | Comment |
---|---|---|---|---|
Capillary | OV-1 | 2395. | Schütz, 1988 | Program: not specified |

References

Schütz, 1988
Schütz, H.,
Modern screening strategies in analytical toxicology with special regard to new benzodiazepines,
Z. Rechtsmed., 1988, 100, 1, 19-37, https://doi.org/10.1007/BF00200362
. [all data]