3-Sulfanylhexyl Octadodecanoate
- Formula: C24H48O2S
- Molecular weight: 400.702
- IUPAC Standard InChIKey: KYFUWFDMLLFQOE-UHFFFAOYSA-N
- Chemical structure:

Normal alkane RI, non-polar column, temperature ramp

Column type | Active phase | I | Reference | Comment |
---|---|---|---|---|
Capillary | SPB-1 | 2816. | Starkenmann, Niclass, et al., 2007 | 30. m/0.25 mm/0.25 μm, He, 50. C @ 5. min, 5. K/min; Tend: 240. C |

References

Starkenmann, Niclass, et al., 2007
Starkenmann, C.; Niclass, Y.; Escher, S.,
Volatile Organic Sulfur-Containing Constituents in Poncirus trifoliata (L.) Raf. (Rutaceae),
J. Agric. Food Chem., 2007, 55, 11, 4511-4517, https://doi.org/10.1021/jf063453h
. [all data]