(+)-1,2,3,6-Tetrahydro-1,4-dimethylazulene
- Formula: C12H16
- Molecular weight: 160.2554
- IUPAC Standard InChIKey: QOXYDBYDOMCGHM-UHFFFAOYSA-N
- Chemical structure:
View 3d structure (requires JavaScript / HTML 5) - Permanent link for this species. Use this link for bookmarking this species for future reference.

Van Den Dool and Kratz RI, non-polar column, custom temperature program

Column type | Active phase | I | Reference | Comment |
---|---|---|---|---|
Capillary | CP Sil 5 CB | 1244. | Adio and Konig, 2007 | Program: not specified |

Normal alkane RI, non-polar column, temperature ramp

Column type | Active phase | I | Reference | Comment |
---|---|---|---|---|
Capillary | CP Sil 5 CB | 1244. | Adio, 2005 | H2, 3. K/min; Column length: 25. m; Tstart: 50. C; Tend: 230. C |

References

Adio and Konig, 2007
Adio, A.M.; Konig, W.A.,
Sesquiterpenoids and norsesquiterpenoids from three liverworts,
Tetrahedron: Asymmetry, 2007, 18, 14, 1693-1700, https://doi.org/10.1016/j.tetasy.2007.06.036
. [all data]
Adio, 2005
Adio, A.M.,
Isolation and structure elucidation of sesquiterpenoids from the essential oils of some liverworths (Hepaticae), Dissertation, Hamburg University, 2005, 265. [all data]