Cyclopropane, 1,2-dichloro, trans
- Formula: C3H4Cl2
- Molecular weight: 110.970
- IUPAC Standard InChIKey: YYQKBUMQNFGUGI-PWNYCUMCSA-N
- Chemical structure:
View 3d structure (requires JavaScript / HTML 5) - Stereoisomers:

Normal alkane RI, non-polar column, custom temperature program

Column type | Active phase | I | Reference | Comment |
---|---|---|---|---|
Capillary | Polydimethyl siloxanes | 1078. | Zenkevich, Eliseenkov, et al., 2006 | Program: not specified |

References

Zenkevich, Eliseenkov, et al., 2006
Zenkevich, I.G.; Eliseenkov, E.V.; Kasatochkin, A.N.,
Application of Retention Indices in GC-MS Identification of Halogenated Organic Compounds,
Mass Spectromery (Rus.), 2006, 3, 2, 131-140. [all data]