cis-Myrtanyl acetate
- Formula: C12H20O2
- Molecular weight: 196.2860
- IUPAC Standard InChIKey: UWHRPSXEBAXLDR-DCAQKATOSA-N
- Chemical structure:
View 3d structure (requires JavaScript / HTML 5) - Stereoisomers:

Van Den Dool and Kratz RI, non-polar column, temperature ramp

Column type | Active phase | I | Reference | Comment |
---|---|---|---|---|
Capillary | BP-1 | 1365. | Gonny, Cavaleiro, et al., 2006 | 50. m/0.22 mm/0.25 μm, He, 2. K/min, 220. C @ 20. min; Tstart: 60. C |

Van Den Dool and Kratz RI, polar column, temperature ramp

Column type | Active phase | I | Reference | Comment |
---|---|---|---|---|
Capillary | BP-20 | 1746. | Gonny, Cavaleiro, et al., 2006 | 50. m/0.22 mm/0.25 μm, He, 2. K/min, 220. C @ 20. min; Tstart: 60. C |

References

Gonny, Cavaleiro, et al., 2006
Gonny, M.; Cavaleiro, C.; Salgueiro, L.; Casanova, J.,
Analysis of Juniperus communis subsp. alpina needle, berry, wood and root oils by combination of GC, GC/MS and 13C-NMR,
Flavour Fragr. J., 2006, 21, 1, 99-106, https://doi.org/10.1002/ffj.1527
. [all data]