2,3-Epoxy-geranial
- Formula: C10H16O2
- Molecular weight: 168.2328
- IUPAC Standard InChIKey: KXDDDNKGVUBFQS-UHFFFAOYSA-N
- Chemical structure:
View 3d structure (requires JavaScript / HTML 5) - Species with the same structure:

Van Den Dool and Kratz RI, non-polar column, temperature ramp

Column type | Active phase | I | Reference | Comment |
---|---|---|---|---|
Capillary | RSL-200 | 1321. | Ngassoum, Ousmaila, et al., 2004 | 30. m/0.32 mm/0.25 μm, H2, 40. C @ 5. min, 6. K/min, 280. C @ 5. min |

References

Ngassoum, Ousmaila, et al., 2004
Ngassoum, M.B.; Ousmaila, H.; Ngamo, L.T.; Maponmetsem, P.M.; Jirovetz, L.; Buchbauer, G.,
Aroma compounds of essential oils of two varieties of the spice plant Ocimum canum Sims from northern Cameroon,
J. Food Comp. Anal., 2004, 17, 2, 197-204, https://doi.org/10.1016/j.jfca.2003.08.002
. [all data]