(10E,12Z)-hexadecadienal
- Formula: C16H28O
- Molecular weight: 236.3929
- IUPAC Standard InChIKey: OSFASEAZCNYZBW-SCFJQAPRSA-N
- Chemical structure:
View 3d structure (requires JavaScript / HTML 5) - Stereoisomers:

Normal alkane RI, non-polar column, temperature ramp

Column type | Active phase | I | Reference | Comment |
---|---|---|---|---|
Capillary | HP-5 | 2047. | Naka, van Vang, et al., 2003 | He, 100. C @ 2. min, 8. K/min, 240. C @ 15. min; Column length: 30. m; Column diameter: 0.25 mm |

References

Naka, van Vang, et al., 2003
Naka, H.; van Vang, L.; Inomata, S.-I.; Ando, T.; Kimura, T.; Honda, H.; Tsuchida, K.; Sakurai, H.,
Sex pheromone of the persimmon fruit moth, Stathmopoda masinissa: identification and laboratory bioassay of (4E, 6Z)-4,6-hexadecadien-1-ol derivatives,
J. Chem. Ecol., 2003, 29, 11, 2447-2459, https://doi.org/10.1023/A:1026301800140
. [all data]